Target
Sodium-dependent dopamine transporter
Ligand
BDBM50161097
Substrate
Meas. Tech.
ChEMBL_1571955 (CHEMBL3796413)
Ki
5470±n/a nM
Citation
 Joolakanti, SRNickell, JRJanganati, VZheng, GDwoskin, LPCrooks, PA Lobelane analogues containing 4-hydroxy and 4-(2-fluoroethoxy) aromatic substituents: Potent and selective inhibitors of [(3)H]dopamine uptake at the vesicular monoamine transporter-2. Bioorg Med Chem Lett 26:2422-7 (2016)  
Target
Name:
Sodium-dependent dopamine transporter
Synonyms:
DA transporter SC6A3_RAT Sodium-dependent dopamine transporter | Sodium-dependent dopamine transporter (DAT)
Type:
Multi-pass membrane protein
Mol. Mass.:
68749.45
Organism:
Rattus norvegicus (rat)
Description:
P23977
Residue:
619
  
Inhibitor
Name:
BDBM50161097
Synonyms:
CHEMBL3793787
Type:
Small organic molecule
Emp. Form.:
C26H37ClFNO4
Mol. Mass.:
482.028
SMILES:
Cl.OC[C@H](O)CN1[C@@H](CCc2ccc(O)cc2)CCC[C@H]1CCc1ccc(OCCF)cc1
: