Target
Sodium-dependent dopamine transporter
Ligand
BDBM50080827
Substrate
Meas. Tech.
ChEMBL_1571955 (CHEMBL3796413)
Ki
1050±n/a nM
Citation
 Joolakanti, SRNickell, JRJanganati, VZheng, GDwoskin, LPCrooks, PA Lobelane analogues containing 4-hydroxy and 4-(2-fluoroethoxy) aromatic substituents: Potent and selective inhibitors of [(3)H]dopamine uptake at the vesicular monoamine transporter-2. Bioorg Med Chem Lett 26:2422-7 (2016)  
Target
Name:
Sodium-dependent dopamine transporter
Synonyms:
DA transporter SC6A3_RAT Sodium-dependent dopamine transporter | Sodium-dependent dopamine transporter (DAT)
Type:
Multi-pass membrane protein
Mol. Mass.:
68749.45
Organism:
Rattus norvegicus (rat)
Description:
P23977
Residue:
619
  
Inhibitor
Name:
BDBM50080827
Synonyms:
(2R,6S)-1-Methyl-2,6-diphenethyl-piperidine CHEMBL1085811 Lobelane | cis-N-methyl-2,6-diphenethylpiperidine
Type:
Small organic molecule
Emp. Form.:
C22H29N
Mol. Mass.:
307.4724
SMILES:
CN1[C@@H](CCc2ccccc2)CCC[C@H]1CCc1ccccc1
: