Target
Sodium-dependent serotonin transporter
Ligand
BDBM50157071
Substrate
Meas. Tech.
ChEMBL_1571956 (CHEMBL3796414)
Ki
2130±n/a nM
Citation
 Joolakanti, SRNickell, JRJanganati, VZheng, GDwoskin, LPCrooks, PA Lobelane analogues containing 4-hydroxy and 4-(2-fluoroethoxy) aromatic substituents: Potent and selective inhibitors of [(3)H]dopamine uptake at the vesicular monoamine transporter-2. Bioorg Med Chem Lett 26:2422-7 (2016)  
Target
Name:
Sodium-dependent serotonin transporter
Synonyms:
5-HT Transporter 5HT transporter Anandamid membrane transporter, AMT Monoamine transporters; Norepinephrine & serotonin Slc6a4 Sodium-dependent serotonin transporter (SERT) | imipramine receptor
Type:
Multi-pass membrane protein
Mol. Mass.:
70168.43
Organism:
Rattus norvegicus (rat)
Description:
P31652
Residue:
630
  
Inhibitor
Name:
BDBM50157071
Synonyms:
CHEMBL3793895
Type:
Small organic molecule
Emp. Form.:
C25H32ClNO4
Mol. Mass.:
445.979
SMILES:
Cl.CC(=O)Oc1ccc(CC[C@H]2CCC[C@@H](CCc3ccc(OC(C)=O)cc3)N2)cc1
: