Target
Sodium-dependent dopamine transporter
Ligand
BDBM50157214
Substrate
Meas. Tech.
ChEMBL_1571955 (CHEMBL3796413)
Ki
1670±n/a nM
Citation
 Joolakanti, SRNickell, JRJanganati, VZheng, GDwoskin, LPCrooks, PA Lobelane analogues containing 4-hydroxy and 4-(2-fluoroethoxy) aromatic substituents: Potent and selective inhibitors of [(3)H]dopamine uptake at the vesicular monoamine transporter-2. Bioorg Med Chem Lett 26:2422-7 (2016)  
Target
Name:
Sodium-dependent dopamine transporter
Synonyms:
DA transporter SC6A3_RAT Sodium-dependent dopamine transporter | Sodium-dependent dopamine transporter (DAT)
Type:
Multi-pass membrane protein
Mol. Mass.:
68749.45
Organism:
Rattus norvegicus (rat)
Description:
P23977
Residue:
619
  
Inhibitor
Name:
BDBM50157214
Synonyms:
CHEMBL3793720
Type:
Small organic molecule
Emp. Form.:
C25H34ClF2NO2
Mol. Mass.:
453.993
SMILES:
Cl.FCCOc1ccc(CC[C@H]2CCC[C@@H](CCc3ccc(OCCF)cc3)N2)cc1
: