Target
Nuclear receptor ROR-alpha
Ligand
BDBM50108881
Substrate
Meas. Tech.
ChEMBL_1571961 (CHEMBL3796419)
EC50
390±n/a nM
Citation
 Enyedy, IJPowell, NACaravella, Jvan Vloten, KChao, JBanerjee, DMarcotte, DSilvian, LMcKenzie, AHong, VSFontenot, JD Discovery of biaryls as ROR¿ inverse agonists by using structure-based design. Bioorg Med Chem Lett 26:2459-63 (2016)  
Target
Name:
Nuclear receptor ROR-alpha
Synonyms:
NR1F1 Nuclear receptor subfamily 1 group F member 1 RORA RZRA | Retinoid-related orphan receptor-alpha
Type:
PROTEIN
Mol. Mass.:
58976.26
Organism:
Homo sapiens (Human)
Description:
ChEMBL_101591
Residue:
523
  
Inhibitor
Name:
BDBM50108881
Synonyms:
CHEMBL3596591
Type:
Small organic molecule
Emp. Form.:
C23H17Cl2FN2O2
Mol. Mass.:
443.298
SMILES:
NC(=O)c1ccc(Cl)c(c1)-c1ccc2N(CCCc2c1)C(=O)c1c(F)cccc1Cl
: