Target
Proteinase-activated receptor 2
Ligand
BDBM50203296
Substrate
Meas. Tech.
ChEMBL_1624981 (CHEMBL3867393)
IC50
1995±n/a nM
Citation
 Yau, MKLiu, LSuen, JYLim, JLohman, RJJiang, YCotterell, AJBarry, GDMak, JYVesey, DAReid, RCFairlie, DP PAR2 Modulators Derived from GB88. ACS Med Chem Lett 7:1179-1184 (2016)  
Target
Name:
Proteinase-activated receptor 2
Synonyms:
F2RL1 PAR2 | PAR2_HUMAN
Type:
PROTEIN
Mol. Mass.:
44152.54
Organism:
Homo sapiens (Human)
Description:
ChEMBL_1497756
Residue:
397
  
Inhibitor
Name:
BDBM50203296
Synonyms:
CHEMBL3959120
Type:
Small organic molecule
Emp. Form.:
C32H44N4O5
Mol. Mass.:
564.7156
SMILES:
CC[C@H](C)[C@H](NC(=O)[C@H](CC1CCCCC1)NC(=O)c1ccno1)C(=O)N1CCC2(CC1)CCc1ccccc1O2
: