Target
Substance-K receptor
Ligand
BDBM50217507
Substrate
Meas. Tech.
ChEBML_142706
IC50
34±n/a nM
Citation
 Nishi, TFukazawa, TIshibashi, KNakajima, KSugioka, YIio, YKurata, HItoh, KMukaiyama, OSatoh, YYamaguchi, T Combined NK1 and NK2 tachykinin receptor antagonists: synthesis and structure-activity relationships of novel oxazolidine analogues. Bioorg Med Chem Lett 9:875-80 (1999)  
Target
Name:
Substance-K receptor
Synonyms:
NK2R_CAVPO Neurokinin NK2 TACR2
Type:
Enzyme Catalytic Domain
Mol. Mass.:
45106.00
Organism:
GUINEA PIG
Description:
Neurokinin NK2 TACR2 GUINEA PIG::Q64077
Residue:
402
  
Inhibitor
Name:
BDBM50217507
Synonyms:
CHEMBL171704
Type:
Small organic molecule
Emp. Form.:
C34H37Cl2N3O6
Mol. Mass.:
654.58
SMILES:
COc1cc(cc(OC)c1OC)C(=O)N1CO[C@@](CCN2CCC3(CC2)C(=O)N(C)c2ccccc32)(C1)c1ccc(Cl)c(Cl)c1
: