Target
Estrogen receptor beta
Ligand
BDBM50023749
Substrate
Meas. Tech.
ChEMBL_66542 (CHEMBL677809)
EC50
3.2±n/a nM
Citation
 Ruenitz, PCBagley, JRNanavati, NT Synthesis and estrogen receptor selectivity of 1,1-bis(4-hydroxyphenyl)-2-(p-halophenyl)ethylenes. J Med Chem 31:1471-5 (1988)  
Target
Name:
Estrogen receptor beta
Synonyms:
Estrogen receptor
Type:
Mol. Mass.:
Description:
ASSAY_ID of ChEMBL is 66549
Components:
This complex has 2 components.
Component 1
Name:
Estrogen receptor
Synonyms:
ESR1_RAT Esr1 Nr3a1 | estrogen alpha
Type:
Enzyme Catalytic Domain
Mol. Mass.:
67045.89
Organism:
RAT
Description:
estrogen alpha 0 RAT::P06211
Residue:
600
  
Component 2
Name:
Estrogen receptor beta
Synonyms:
ESR2_RAT Esr2 Estrogen receptor beta | Nr3a2
Type:
PROTEIN
Mol. Mass.:
59173.80
Organism:
Rattus norvegicus
Description:
ChEMBL_803011
Residue:
530
  
Inhibitor
Name:
BDBM50023749
Synonyms:
4-(1,2-diphenyl-vinyl)-phenol CHEMBL415864
Type:
Small organic molecule
Emp. Form.:
C20H16O2
Mol. Mass.:
288.3398
SMILES:
[#8]-c1ccc(cc1)-[#6](=[#6]\c1ccccc1)\c1ccc(-[#8])cc1
: