Target
Transient receptor potential cation channel subfamily V member 4
Ligand
BDBM50232796
Substrate
Meas. Tech.
ChEMBL_1648650 (CHEMBL3997706)
IC50
250±n/a nM
Citation
 Cheung, MBao, WBehm, DJBrooks, CABury, MJDowdell, SEEidam, HSFox, RMGoodman, KBHolt, DALee, DRoethke, TJWillette, RNXu, XYe, GThorneloe, KS Discovery of GSK2193874: An Orally Active, Potent, and Selective Blocker of Transient Receptor Potential Vanilloid 4. ACS Med Chem Lett 8:549-554 (2017)  
Target
Name:
Transient receptor potential cation channel subfamily V member 4
Synonyms:
TRPV4 Transient receptor potential cation channel subfamily V member 4 (TRPV4) VROAC
Type:
Enzyme
Mol. Mass.:
98290.10
Organism:
Homo sapiens (Human)
Description:
Q9HBA0
Residue:
871
  
Inhibitor
Name:
BDBM50232796
Synonyms:
CHEMBL4094483
Type:
Small organic molecule
Emp. Form.:
C38H41F3N4O2
Mol. Mass.:
642.7529
SMILES:
COc1ccc2c(C(=O)NC3(CC3)c3ccccc3)c(CN3CCC(CC3)N3CCCCC3)c(nc2c1)-c1cccc(c1)C(F)(F)F
: