Target
Transient receptor potential cation channel subfamily V member 4
Ligand
BDBM50232797
Substrate
Meas. Tech.
ChEMBL_1648650 (CHEMBL3997706)
IC50
40±n/a nM
Citation
 Cheung, MBao, WBehm, DJBrooks, CABury, MJDowdell, SEEidam, HSFox, RMGoodman, KBHolt, DALee, DRoethke, TJWillette, RNXu, XYe, GThorneloe, KS Discovery of GSK2193874: An Orally Active, Potent, and Selective Blocker of Transient Receptor Potential Vanilloid 4. ACS Med Chem Lett 8:549-554 (2017)  
Target
Name:
Transient receptor potential cation channel subfamily V member 4
Synonyms:
TRPV4 Transient receptor potential cation channel subfamily V member 4 (TRPV4) VROAC
Type:
Enzyme
Mol. Mass.:
98290.10
Organism:
Homo sapiens (Human)
Description:
Q9HBA0
Residue:
871
  
Inhibitor
Name:
BDBM50232797
Synonyms:
CHEMBL4073922
Type:
Small organic molecule
Emp. Form.:
C37H38BrF3N4O
Mol. Mass.:
691.623
SMILES:
FC(F)(F)c1cccc(c1)-c1nc2cc(Br)ccc2c(C(=O)NC2(CC2)c2ccccc2)c1CN1CCC(CC1)N1CCCCC1
: