Target
Transient receptor potential cation channel subfamily V member 4
Ligand
BDBM50232799
Substrate
Meas. Tech.
ChEMBL_1648650 (CHEMBL3997706)
IC50
60±n/a nM
Citation
 Cheung, MBao, WBehm, DJBrooks, CABury, MJDowdell, SEEidam, HSFox, RMGoodman, KBHolt, DALee, DRoethke, TJWillette, RNXu, XYe, GThorneloe, KS Discovery of GSK2193874: An Orally Active, Potent, and Selective Blocker of Transient Receptor Potential Vanilloid 4. ACS Med Chem Lett 8:549-554 (2017)  
Target
Name:
Transient receptor potential cation channel subfamily V member 4
Synonyms:
TRPV4 Transient receptor potential cation channel subfamily V member 4 (TRPV4) VROAC
Type:
Enzyme
Mol. Mass.:
98290.10
Organism:
Homo sapiens (Human)
Description:
Q9HBA0
Residue:
871
  
Inhibitor
Name:
BDBM50232799
Synonyms:
CHEMBL4078886
Type:
Small organic molecule
Emp. Form.:
C36H35BrF6N4O
Mol. Mass.:
733.584
SMILES:
FC(F)(F)[C@H](NC(=O)c1c(CN2CCC(CC2)N2CCCCC2)c(nc2cc(Br)ccc12)-c1cccc(c1)C(F)(F)F)c1ccccc1
: