Target
Substance-K receptor
Ligand
BDBM50232795
Substrate
Meas. Tech.
ChEMBL_1648652 (CHEMBL3997708)
IC50
100±n/a nM
Citation
 Cheung, MBao, WBehm, DJBrooks, CABury, MJDowdell, SEEidam, HSFox, RMGoodman, KBHolt, DALee, DRoethke, TJWillette, RNXu, XYe, GThorneloe, KS Discovery of GSK2193874: An Orally Active, Potent, and Selective Blocker of Transient Receptor Potential Vanilloid 4. ACS Med Chem Lett 8:549-554 (2017)  
Target
Name:
Substance-K receptor
Synonyms:
NK-2 receptor NK2R NKNAR Neurokinin A receptor Neurokinin-2 (NK-2) SKR TACR2 Tachykinin receptor 2 (NK2) | hnk-3
Type:
Protein
Mol. Mass.:
44455.78
Organism:
Homo sapiens (Human)
Description:
P21452
Residue:
398
  
Inhibitor
Name:
BDBM50232795
Synonyms:
CHEMBL4092276
Type:
Small organic molecule
Emp. Form.:
C35H40N4O
Mol. Mass.:
532.7183
SMILES:
C[C@H](NC(=O)c1c(CN2CCC(CC2)N2CCCCC2)c(nc2ccccc12)-c1ccccc1)c1ccccc1
: