Target
Transient receptor potential cation channel subfamily V member 4
Ligand
BDBM50232806
Substrate
Meas. Tech.
ChEMBL_1648651 (CHEMBL3997707)
IC50
50±n/a nM
Citation
 Cheung, MBao, WBehm, DJBrooks, CABury, MJDowdell, SEEidam, HSFox, RMGoodman, KBHolt, DALee, DRoethke, TJWillette, RNXu, XYe, GThorneloe, KS Discovery of GSK2193874: An Orally Active, Potent, and Selective Blocker of Transient Receptor Potential Vanilloid 4. ACS Med Chem Lett 8:549-554 (2017)  
Target
Name:
Transient receptor potential cation channel subfamily V member 4
Synonyms:
TRPV4_RAT Vanilloid receptor | Vroac
Type:
PROTEIN
Mol. Mass.:
98016.72
Organism:
Rattus norvegicus
Description:
ChEMBL_1514408
Residue:
871
  
Inhibitor
Name:
BDBM50232806
Synonyms:
CHEMBL4072053
Type:
Small organic molecule
Emp. Form.:
C35H37F3N4O
Mol. Mass.:
586.6897
SMILES:
FC(F)(F)c1cccc(c1)-c1nc2ccccc2c(C(=O)NCc2ccccc2)c1CN1CCC(CC1)N1CCCCC1
: