Target
Transient receptor potential cation channel subfamily V member 4
Ligand
BDBM50232808
Substrate
Meas. Tech.
ChEMBL_1648651 (CHEMBL3997707)
IC50
320±n/a nM
Citation
 Cheung, MBao, WBehm, DJBrooks, CABury, MJDowdell, SEEidam, HSFox, RMGoodman, KBHolt, DALee, DRoethke, TJWillette, RNXu, XYe, GThorneloe, KS Discovery of GSK2193874: An Orally Active, Potent, and Selective Blocker of Transient Receptor Potential Vanilloid 4. ACS Med Chem Lett 8:549-554 (2017)  
Target
Name:
Transient receptor potential cation channel subfamily V member 4
Synonyms:
TRPV4_RAT Vanilloid receptor | Vroac
Type:
PROTEIN
Mol. Mass.:
98016.72
Organism:
Rattus norvegicus
Description:
ChEMBL_1514408
Residue:
871
  
Inhibitor
Name:
BDBM50232808
Synonyms:
CHEMBL4071019
Type:
Small organic molecule
Emp. Form.:
C33H35F3N4O
Mol. Mass.:
560.6524
SMILES:
C[C@H](NC(=O)c1c(CN2CCC(CC2)N(C)C)c(nc2ccccc12)-c1cccc(c1)C(F)(F)F)c1ccccc1
: