Target
Transient receptor potential cation channel subfamily V member 4
Ligand
BDBM50232815
Substrate
Meas. Tech.
ChEMBL_1648650 (CHEMBL3997706)
IC50
80±n/a nM
Citation
 Cheung, MBao, WBehm, DJBrooks, CABury, MJDowdell, SEEidam, HSFox, RMGoodman, KBHolt, DALee, DRoethke, TJWillette, RNXu, XYe, GThorneloe, KS Discovery of GSK2193874: An Orally Active, Potent, and Selective Blocker of Transient Receptor Potential Vanilloid 4. ACS Med Chem Lett 8:549-554 (2017)  
Target
Name:
Transient receptor potential cation channel subfamily V member 4
Synonyms:
TRPV4 Transient receptor potential cation channel subfamily V member 4 (TRPV4) VROAC
Type:
Enzyme
Mol. Mass.:
98290.10
Organism:
Homo sapiens (Human)
Description:
Q9HBA0
Residue:
871
  
Inhibitor
Name:
BDBM50232815
Synonyms:
CHEMBL4104743
Type:
Small organic molecule
Emp. Form.:
C39H43F3N4O2
Mol. Mass.:
656.7795
SMILES:
CCOc1ccc2c(C(=O)NC3(CC3)c3ccccc3)c(CN3CCC(CC3)N3CCCCC3)c(nc2c1)-c1cccc(c1)C(F)(F)F
: