Target
Transient receptor potential cation channel subfamily V member 4
Ligand
BDBM50192821
Substrate
Meas. Tech.
ChEMBL_1648699 (CHEMBL3997755)
IC50
133±n/a nM
Citation
 Cheung, MBao, WBehm, DJBrooks, CABury, MJDowdell, SEEidam, HSFox, RMGoodman, KBHolt, DALee, DRoethke, TJWillette, RNXu, XYe, GThorneloe, KS Discovery of GSK2193874: An Orally Active, Potent, and Selective Blocker of Transient Receptor Potential Vanilloid 4. ACS Med Chem Lett 8:549-554 (2017)  
Target
Name:
Transient receptor potential cation channel subfamily V member 4
Synonyms:
TRPV4_RAT Vanilloid receptor | Vroac
Type:
PROTEIN
Mol. Mass.:
98016.72
Organism:
Rattus norvegicus
Description:
ChEMBL_1514408
Residue:
871
  
Inhibitor
Name:
BDBM50192821
Synonyms:
CHEMBL2133556
Type:
Small organic molecule
Emp. Form.:
C26H28F3N3O2
Mol. Mass.:
471.5146
SMILES:
Cc1c(cc(-c2ccccc2)n1CCCN1CCOCC1)C(=O)Nc1cccc(c1)C(F)(F)F
: