Target
Aromatase [1-48]
Ligand
BDBM85250
Substrate
Meas. Tech.
Biological Assay
IC50
200±n/a nM
Citation
 Pouget, CYahiaoui, SFagnere, CHabrioux, GChulia, AJ Synthesis and biological evaluation of 4-imidazolylflavans as nonsteroidal aromatase inhibitors. Bioorg Chem 32:494-503 (2004)  
Target
Name:
Aromatase [1-48]
Synonyms:
ARO1 CP19A_HUMAN CYP19 | CYP19A1
Type:
Protein
Mol. Mass.:
5299.77
Organism:
Homo sapiens (Human)
Description:
Q16449
Residue:
48
  
Inhibitor
Name:
BDBM85250
Synonyms:
2,4-Trans-4'-chloro-4-imidazolyl-7-methoxyflavan, 3b
Type:
Small organic molecule
Emp. Form.:
C19H17ClN2O2
Mol. Mass.:
340.803
SMILES:
COc1ccc2C(CC(Oc2c1)c1ccc(Cl)cc1)n1ccnc1
: