Target
Polyphenol oxidase 2
Ligand
BDBM50242014
Substrate
BDBM18129
Meas. Tech.
Tyrosinase Assay
Temperature
303.15±0 K
IC50
>2.503e+5±n/a nM
Citation
 Ryu, YBHa, TJCurtis-Long, MJRyu, HWGal, SWPark, KH Inhibitory effects on mushroom tyrosinase by flavones from the stem barks of Morus lhou (S.) Koidz. J Enzyme Inhib Med Chem 23:922-30 (2008)  
Target
Name:
Polyphenol oxidase 2
Synonyms:
Monophenol monooxygenase PPO2 Tyrosinase
Type:
Protein
Mol. Mass.:
63923.66
Organism:
Agaricus bisporus (Common mushroom)
Description:
O42713
Residue:
556
  
Inhibitor
Name:
BDBM50242014
Synonyms:
CHEMBL464006 Morusin, 3 cid_5281671
Type:
Small organic molecule
Emp. Form.:
C25H24O6
Mol. Mass.:
420.4545
SMILES:
[#6]\[#6](-[#6])=[#6]\[#6]-c1c(oc2c3-[#6]=[#6]C([#6])([#6])[#8]-c3cc(-[#8])c2c1=O)-c1ccc(-[#8])cc1-[#8]
:
Substrate
Name:
BDBM18129
Synonyms:
(2S)-2-amino-3-(4-hydroxyphenyl)propanoic acid Tyrosine | US11021454, Compound L-tyr
Type:
Amino Acid
Emp. Form.:
C9H11NO3
Mol. Mass.:
181.1885
SMILES:
N[C@@H](Cc1ccc(O)cc1)C(O)=O
: