Target
11-beta-hydroxysteroid dehydrogenase 1
Ligand
BDBM107484
Substrate
Meas. Tech.
Biological Assay Example 1
IC50
1.48±0.0 nM
Citation
 Claremon, DAZhuang, LLeftheris, KTice, CMYe, YSingh, SBHimmelsbach, F Cyclic inhibitors of 11BETA-hydroxysteroid dehydrogenase 1 US Patent  US8592410 Publication Date 11/26/2013 
Target
Name:
11-beta-hydroxysteroid dehydrogenase 1
Synonyms:
11-DH 11-beta-Hydroxysteroid Dehydrogenase 1 (11-beta-HSD1) 11-beta-hydroxysteroid dehydrogenase 1 (11HSD1) Corticosteroid 11-beta-dehydrogenase isozyme 1 (11-beta-HSD-1) Corticosteroid 11-beta-dehydrogenase isozyme 1 (11beta-HSD1) HSD11 HSD11L | SDR26C1
Type:
Enzyme
Mol. Mass.:
32409.16
Organism:
Homo sapiens (Human)
Description:
P28845
Residue:
292
  
Inhibitor
Name:
BDBM107484
Synonyms:
US8575157, 194 US8598163, 64
Type:
Small organic molecule
Emp. Form.:
C28H28F3NO3
Mol. Mass.:
483.522
SMILES:
C[C@H](N1CC[C@@](CC(C)(C)O)(OC1=O)c1ccc(F)cc1)c1ccc(cc1)-c1ccc(F)cc1F
: