Target
11-beta-hydroxysteroid dehydrogenase 1
Ligand
BDBM107488
Substrate
Meas. Tech.
Biological Assay Example 1
IC50
1.30±0.0 nM
Citation
 Claremon, DAZhuang, LLeftheris, KTice, CMYe, YSingh, SBHimmelsbach, F Cyclic inhibitors of 11BETA-hydroxysteroid dehydrogenase 1 US Patent  US8592410 Publication Date 11/26/2013 
Target
Name:
11-beta-hydroxysteroid dehydrogenase 1
Synonyms:
11-DH 11-beta-Hydroxysteroid Dehydrogenase 1 (11-beta-HSD1) 11-beta-hydroxysteroid dehydrogenase 1 (11HSD1) Corticosteroid 11-beta-dehydrogenase isozyme 1 (11-beta-HSD-1) Corticosteroid 11-beta-dehydrogenase isozyme 1 (11beta-HSD1) HSD11 HSD11L | SDR26C1
Type:
Enzyme
Mol. Mass.:
32409.16
Organism:
Homo sapiens (Human)
Description:
P28845
Residue:
292
  
Inhibitor
Name:
BDBM107488
Synonyms:
US8575157, 202 US8598163, 72
Type:
Small organic molecule
Emp. Form.:
C21H22F3NO4
Mol. Mass.:
409.3989
SMILES:
C[C@H](N1CC[C@@](CCO)(OC1=O)c1ccc(F)cc1)c1ccc(OC(F)F)cc1
: