Target
11-beta-hydroxysteroid dehydrogenase 1
Ligand
BDBM107481
Substrate
Meas. Tech.
Biological Assay Example 4
IC50
11.97±0.0 nM
Citation
 Claremon, DAZhuang, LLeftheris, KTice, CMYe, YSingh, SBHimmelsbach, F Cyclic inhibitors of 11BETA-hydroxysteroid dehydrogenase 1 US Patent  US8592410 Publication Date 11/26/2013 
Target
Name:
11-beta-hydroxysteroid dehydrogenase 1
Synonyms:
11-DH 11-beta-Hydroxysteroid Dehydrogenase 1 (11-beta-HSD1) 11-beta-hydroxysteroid dehydrogenase 1 (11HSD1) Corticosteroid 11-beta-dehydrogenase isozyme 1 (11-beta-HSD-1) Corticosteroid 11-beta-dehydrogenase isozyme 1 (11beta-HSD1) HSD11 HSD11L | SDR26C1
Type:
Enzyme
Mol. Mass.:
32409.16
Organism:
Homo sapiens (Human)
Description:
P28845
Residue:
292
  
Inhibitor
Name:
BDBM107481
Synonyms:
US8575157, 189 US8598163, 59
Type:
Small organic molecule
Emp. Form.:
C24H21F2NO3
Mol. Mass.:
409.4252
SMILES:
OCC[C@@]1(CCN(C(=O)O1)c1cccc(c1)-c1ccc(F)cc1F)c1ccccc1
: