Target
11-beta-hydroxysteroid dehydrogenase 1
Ligand
BDBM107482
Substrate
Meas. Tech.
Biological Assay Example 4
IC50
14.16±0.0 nM
Citation
 Claremon, DAZhuang, LLeftheris, KTice, CMYe, YSingh, SBHimmelsbach, F Cyclic inhibitors of 11BETA-hydroxysteroid dehydrogenase 1 US Patent  US8592410 Publication Date 11/26/2013 
Target
Name:
11-beta-hydroxysteroid dehydrogenase 1
Synonyms:
11-DH 11-beta-Hydroxysteroid Dehydrogenase 1 (11-beta-HSD1) 11-beta-hydroxysteroid dehydrogenase 1 (11HSD1) Corticosteroid 11-beta-dehydrogenase isozyme 1 (11-beta-HSD-1) Corticosteroid 11-beta-dehydrogenase isozyme 1 (11beta-HSD1) HSD11 HSD11L | SDR26C1
Type:
Enzyme
Mol. Mass.:
32409.16
Organism:
Homo sapiens (Human)
Description:
P28845
Residue:
292
  
Inhibitor
Name:
BDBM107482
Synonyms:
US8575157, 190 US8598163, 60
Type:
Small organic molecule
Emp. Form.:
C23H19F3N2O3
Mol. Mass.:
428.4038
SMILES:
OCCC1(CCN(C(=O)O1)c1cccc(n1)-c1ccc(F)cc1F)c1ccccc1F
: