Target
Cytochrome P450 2C19
Ligand
BDBM107484
Substrate
Meas. Tech.
Biological Assay Example 8
IC50
8.6e+3±n/a nM
Citation
 Claremon, DAZhuang, LLeftheris, KTice, CMYe, YSingh, SBHimmelsbach, F Cyclic inhibitors of 11BETA-hydroxysteroid dehydrogenase 1 US Patent  US8592410 Publication Date 11/26/2013 
Target
Name:
Cytochrome P450 2C19
Synonyms:
(R)-limonene 6-monooxygenase (S)-limonene 7-monooxygenase CYP2C19 CYPIIC19 Cytochrome P450 2C19 [I331V] Cytochrome P450-254C Mephenytoin 4-hydroxylase P450-254C
Type:
Enzyme
Mol. Mass.:
55935.47
Organism:
Homo sapiens (Human)
Description:
P33261
Residue:
490
  
Inhibitor
Name:
BDBM107484
Synonyms:
US8575157, 194 US8598163, 64
Type:
Small organic molecule
Emp. Form.:
C28H28F3NO3
Mol. Mass.:
483.522
SMILES:
C[C@H](N1CC[C@@](CC(C)(C)O)(OC1=O)c1ccc(F)cc1)c1ccc(cc1)-c1ccc(F)cc1F
: