Target
5-hydroxytryptamine receptor 2A
Ligand
BDBM50352720
Substrate
Meas. Tech.
Binding Assay
pH
7.4±n/a
IC50
244±n/a nM
Comments
extracted
Citation
 Lee, JSeo, HJKang, SYPark, EKim, MJLee, SHKim, JYKim, JJung, MEKim, HJKim, MHan, HKAhn, KWLee, MWLee, KPae, ANPark, W Arylpiperazine-containing imidazole 4-carboxamide derivatives and pharmaceutical composition comprising same US Patent  US8835436 Publication Date 9/16/2014 
Target
Name:
5-hydroxytryptamine receptor 2A
Synonyms:
5-HT-2 5-HT2A 5-hydroxytryptamine receptor 2A (5HT-2A) 5HT2A_HUMAN HTR2A | Serotonin receptor 2A
Type:
undefined
Mol. Mass.:
52607.65
Organism:
Homo sapiens (Human)
Description:
P28223
Residue:
471
  
Inhibitor
Name:
BDBM50352720
Synonyms:
CHEMBL1823216 | US8835436, Example 140
Type:
Small organic molecule
Emp. Form.:
C27H34FN5O2
Mol. Mass.:
479.5896
SMILES:
Cc1nc(C(=O)NC[C@H](O)CN2CCN(CC2)c2cccc(C)c2C)c(C)n1-c1ccccc1F
: