Target
5-hydroxytryptamine receptor 2C
Ligand
BDBM139371
Substrate
Meas. Tech.
Radioligand Binding Assay
Temperature
277.15±n/a K
Ki
1.3±0.51 nM
Comments
extracted
Citation
 Vanover, KEWeiner, DMMakhay, MVeinbergs, IGardell, LRLameh, JDel Tredici, ALPiu, FSchiffer, HHOtt, TRBurstein, ESUldam, AKThygesen, MBSchlienger, NAndersson, CMSon, TYHarvey, SCPowell, SBGeyer, MATolf, BRBrann, MRDavis, RE Pharmacological and behavioral profile of N-(4-fluorophenylmethyl)-N-(1-methylpiperidin-4-yl)-N'-(4-(2-methylpropyloxy)phenylmethyl) carbamide (2R,3R)-dihydroxybutanedioate (2:1) (ACP-103), a novel 5-hydroxytryptamine(2A) receptor inverse agonist. J Pharmacol Exp Ther 317:910-8 (2006)  
Target
Name:
5-hydroxytryptamine receptor 2C
Synonyms:
5-HT-1C 5-HT1C 5-HT2C-INI 5-HTR2C 5-hydroxytryptamine receptor 2C (5-HT-2C) 5HT-1C HTR1C Serotonin (5-HT3) receptor Serotonin Receptor 2C
Type:
G Protein-Coupled Receptor (GPCR)
Mol. Mass.:
51836.79
Organism:
Homo sapiens (Human)
Description:
P28335
Residue:
458
  
Inhibitor
Name:
BDBM139371
Synonyms:
eplivanserin
Type:
Small organic molecule
Emp. Form.:
C19H21FN2O2
Mol. Mass.:
328.3806
SMILES:
[#6]-[#7](-[#6])-[#6]-[#6]-[#8]-[#7]\[#6](=[#6]\[#6]=[#6]-1\[#6]=[#6]-[#6](=O)-[#6]=[#6]-1)-c1ccccc1F
: