Target
Proteasome subunit alpha type-2
Ligand
BDBM154578
Substrate
Meas. Tech.
ChTL Inhibition Assays
pH
7.5±n/a
IC50
1.5±0.2 nM
Comments
extracted
Citation
 Trivella, DBPereira, ARStein, MLKasai, YByrum, TValeriote, FATantillo, DJGroll, MGerwick, WHMoore, BS Enzyme inhibition by hydroamination: design and mechanism of a hybrid carmaphycin-syringolin enone proteasome inhibitor. Chem Biol 21:782-91 (2014)  
Target
Name:
Proteasome subunit alpha type-2
Synonyms:
20S proteasome PRS4 | PSA2_YEAST
Type:
Protein
Mol. Mass.:
27159.02
Organism:
Saccharomyces cerevisiae s288c (Yeast)
Description:
Residue:
250
  
Inhibitor
Name:
BDBM154578
Synonyms:
Carmaphycin A (1)
Type:
Small organic molecule
Emp. Form.:
C25H45N3O6S
Mol. Mass.:
515.706
SMILES:
CCCCCC(=O)N[C@@H](C(C)C)C(=O)N[C@@H](CCS(C)=O)C(=O)N[C@@H](CC(C)C)C(=O)[C@@]1(C)CO1
: