Target
Oxysterols receptor LXR-beta
Ligand
BDBM155262
Substrate
Meas. Tech.
Radioligand Binding Assay
Ki
846±n/a nM
Citation
 Dong, CFan, YLeftheris, KLotesta, SDSingh, SBTice, CMZhao, WZheng, YZhuang, L Liver X receptor modulators US Patent  US9006244 Publication Date 4/14/2015 
Target
Name:
Oxysterols receptor LXR-beta
Synonyms:
LXRB Liver X, LXR beta NR1H2 Nuclear receptor NER Ubiquitously-expressed nuclear receptor
Type:
Enzyme Catalytic Domain
Mol. Mass.:
50978.79
Organism:
Homo sapiens (Human)
Description:
P55055
Residue:
460
  
Inhibitor
Name:
BDBM155262
Synonyms:
US9006244, E4b | US9814715, Example 4, isomer 2
Type:
Small organic molecule
Emp. Form.:
C21H23F3N4O3S
Mol. Mass.:
468.493
SMILES:
CC(C)[C@@H]1N(CCn2c1cc1cc(CO)c(cc21)S(C)(=O)=O)c1nccc(n1)C(F)(F)F
: