Target
Glycogen synthase kinase-3 alpha
Ligand
BDBM173196
Substrate
Meas. Tech.
Mobility Shift Microfluidics Assay
pH
7.5±n/a
Temperature
298.15±n/a K
IC50
39± 30 nM
Comments
extracted
Citation
 Wagner, FFBishop, JAGale, JPShi, XWalk, MKetterman, JPatnaik, DBarker, DWalpita, DCampbell, AJNguyen, SLewis, MRoss, LWeïwer, MAn, WFGermain, ARNag, PPMetkar, SKaya, TDandapani, SOlson, DEBarbe, ALLazzaro, FSacher, JRCheah, JHFei, DPerez, JMunoz, BPalmer, MStegmaier, KSchreiber, SLScolnick, EZhang, YLHaggarty, SJHolson, EBPan, JQ Inhibitors of Glycogen Synthase Kinase 3 with Exquisite Kinome-Wide Selectivity and Their Functional Effects. ACS Chem Biol 11:1952-63 (2016)  
Target
Name:
Glycogen synthase kinase-3 alpha
Synonyms:
GSK-3 alpha GSK3A_HUMAN Glycogen synthase kinase-3 Glycogen synthase kinase-3 alpha (GSK3 Alpha) Glycogen synthase kinase-3 alpha (GSK3alpha)
Type:
Enzyme
Mol. Mass.:
50991.79
Organism:
Homo sapiens (Human)
Description:
P49840
Residue:
483
  
Inhibitor
Name:
BDBM173196
Synonyms:
4-(2-methoxyphenyl)-3,7,7-trimethyl-2,4,6,7,8,9-hexahydro-5H-pyrazolo[3,4-b]quinolin-5-one (12) US9096594, 22
Type:
Small organic molecule
Emp. Form.:
C20H23N3O2
Mol. Mass.:
337.4155
SMILES:
COc1ccccc1C1c2c(C)[nH]nc2NC2=C1C(=O)CC(C)(C)C2
: