Target
Glycogen synthase kinase-3 beta
Ligand
BDBM188502
Substrate
Meas. Tech.
Mobility Shift Microfluidics Assay
pH
7.5±n/a
Temperature
298.15±n/a K
IC50
319± 139 nM
Comments
extracted
Citation
 Wagner, FFBishop, JAGale, JPShi, XWalk, MKetterman, JPatnaik, DBarker, DWalpita, DCampbell, AJNguyen, SLewis, MRoss, LWeïwer, MAn, WFGermain, ARNag, PPMetkar, SKaya, TDandapani, SOlson, DEBarbe, ALLazzaro, FSacher, JRCheah, JHFei, DPerez, JMunoz, BPalmer, MStegmaier, KSchreiber, SLScolnick, EZhang, YLHaggarty, SJHolson, EBPan, JQ Inhibitors of Glycogen Synthase Kinase 3 with Exquisite Kinome-Wide Selectivity and Their Functional Effects. ACS Chem Biol 11:1952-63 (2016)  
Target
Name:
Glycogen synthase kinase-3 beta
Synonyms:
GSK-3 beta GSK3B Glycogen synthase kinase 3 beta (GSK3B) Glycogen synthase kinase-3 beta (GSK-3B) Glycogen synthase kinase-3 beta (GSK3B) Glycogen synthase kinase-3beta (GSK3B) | Serine/threonine-protein kinase GSK3B
Type:
Enzyme
Mol. Mass.:
46756.38
Organism:
Homo sapiens (Human)
Description:
P49841
Residue:
420
  
Inhibitor
Name:
BDBM188502
Synonyms:
3,7,7-trimethyl-4-(pyridin-2-yl)-2,4,6,7,8,9-hexahydro-5H-pyrazolo[3,4-b]quinolin-5-one (5) | US10137122, Compound 36
Type:
Small organic molecule
Emp. Form.:
C18H20N4O
Mol. Mass.:
308.3776
SMILES:
Cc1[nH]nc2NC3=C(C(c12)c1ccccn1)C(=O)CC(C)(C)C3
: