Target
Complement factor D [24-253]
Ligand
BDBM171350
Substrate
Meas. Tech.
Complement FD Thioesterolysis Assay
pH
7.5±n/a
Temperature
298.15±n/a K
IC50
6± 2 nM
Comments
extracted
Citation
 Maibaum, JLiao, SMVulpetti, AOstermann, NRandl, SRüdisser, SLorthiois, EErbel, PKinzel, BKolb, FABarbieri, SWagner, JDurand, CFettis, KDussauge, SHughes, NDelgado, OHommel, UGould, TMac Sweeney, AGerhartz, BCumin, FFlohr, SSchubart, AJaffee, BHarrison, RRisitano, AMEder, JAnderson, K Small-molecule factor D inhibitors targeting the alternative complement pathway. Nat Chem Biol 12:1105-1110 (2016)  
Target
Name:
Complement factor D [24-253]
Synonyms:
CFAD_HUMAN Complement factor D (FD) catalytic domain (Human fD) PFD
Type:
Protein
Mol. Mass.:
24622.79
Organism:
Homo sapiens (Human)
Description:
P00746 (24-253 aa)
Residue:
230
  
Inhibitor
Name:
BDBM171350
Synonyms:
1-(2-((1R,3S,5R)-3-((6-Bromopyridin-2-yl)carbamoyl)-2-azabicyclo[3.1.0]hexan-2-yl)-2-oxoethyl)-1H-indazole-3-carboxamide (7) | US9085555, 727
Type:
Small organic molecule
Emp. Form.:
C21H19BrN6O3
Mol. Mass.:
483.318
SMILES:
NC(=O)c1nn(CC(=O)N2[C@@H]3C[C@@H]3C[C@H]2C(=O)Nc2cccc(Br)n2)c2ccccc12
: