Target
Metabotropic glutamate receptor 1
Ligand
BDBM206767
Substrate
Meas. Tech.
FLIPR Calcium 5 Assay
IC50
1987±n/a nM
Citation
 Choo, HMin, SJSeo, SHKim, JYKi, YRKim, MJKim, SKim, Y Thienopyrimidinone derivatives as mGluR1 antagonists US Patent  US9260448 Publication Date 2/16/2016 
Target
Name:
Metabotropic glutamate receptor 1
Synonyms:
GPRC1A GRM1_HUMAN Metabotropic Glutamate 1a | metabotropic glutamate 1
Type:
Enzyme
Mol. Mass.:
132358.19
Organism:
Homo sapiens (Human)
Description:
Q13255
Residue:
1194
  
Inhibitor
Name:
BDBM206767
Synonyms:
US9260448, 69
Type:
Small organic molecule
Emp. Form.:
C20H14N2O4S
Mol. Mass.:
378.401
SMILES:
COc1ccc(cc1)-n1cnc2c(csc2c1=O)-c1ccc2OCOc2c1
: