Target
Sphingosine 1-phosphate receptor 3
Ligand
BDBM50158348
Substrate
Meas. Tech.
In Vitro Binding Assay
IC50
0.400±0.2 nM
Citation
 Tu, ZRosenberg, ALiu, HHan, J Compositions for binding sphingosine-1-phosphate receptor 1 (S1P1), imaging of S1P1, and methods of use thereof US Patent  US10676467 Publication Date 6/9/2020 
Target
Name:
Sphingosine 1-phosphate receptor 3
Synonyms:
C9orf108 EDG3 S1P receptor 3 S1P3 S1PR3_HUMAN Sphingosine 1-phosphate receptor 3 (S1P3) | Sphingosine 1-phosphate receptor Edg-3
Type:
G Protein-Coupled Receptor (GPCR)
Mol. Mass.:
42278.13
Organism:
Homo sapiens (Human)
Description:
Q99500
Residue:
378
  
Inhibitor
Name:
BDBM50158348
Synonyms:
(2S,3R,4E)-2-amino-3-hydroxyoctadec-4-en-1-yl dihydrogen phosphate CHEMBL225155 US11584726, Example S1P sphingosine-1-phosphate
Type:
Small organic molecule
Emp. Form.:
C18H38NO5P
Mol. Mass.:
379.4718
SMILES:
CCCCCCCCCCCCC\C=C\[C@@H](O)[C@@H](N)COP(O)(O)=O
: