Target
Proto-oncogene tyrosine-protein kinase receptor Ret [V804L]
Ligand
BDBM311739
Substrate
Meas. Tech.
Measurement of Inhibitory Activity Against RET (V804L, V804M)
IC50
1.10±n/a nM
Citation
 Miyazaki, IShimamura, TKato, MFujita, HIguchi, S Fused pyrimidine compound or salt thereof US Patent  US10807986 Publication Date 10/20/2020 
Target
Name:
Proto-oncogene tyrosine-protein kinase receptor Ret [V804L]
Synonyms:
CDHF12 PTC RET kinase (V804L) RET51 | RET_HUMAN
Type:
Enzyme Catalytic Domain
Mol. Mass.:
124332.32
Organism:
Homo sapiens (Human)
Description:
P07949[V804L]
Residue:
1114
  
Inhibitor
Name:
BDBM311739
Synonyms:
Ex. Cpd. 191 US11046696, Compound 191
Type:
Small organic molecule
Emp. Form.:
C24H23N7O2
Mol. Mass.:
441.4851
SMILES:
COCc1ccc(NC(=O)c2c(C#Cc3cnc[nH]3)n(c3ncnc(N)c23)C2(C)CC2)cc1
: