Target
Replicase polyprotein 1ab
Ligand
BDBM496822
Substrate
Meas. Tech.
PLpro Primary Assay
IC50
5700±n/a nM
Citation
 Shen, ZRatia, KCooper, LKong, DLee, HKwon, YLi, YAlqarni, SHuang, FDubrovskyi, ORong, LThatcher, GRJXiong, R Design of SARS-CoV-2 PLpro Inhibitors for COVID-19 Antiviral Therapy Leveraging Binding Cooperativity. J Med Chem 0:0 (2021)  
Target
Name:
Replicase polyprotein 1ab
Synonyms:
ORF1ab polyprotein pp1ab | rep
Type:
Protein
Mol. Mass.:
794070.71
Organism:
2019-nCoV
Description:
P0DTD1
Residue:
7096
  
Inhibitor
Name:
BDBM496822
Synonyms:
SARS-CoV-2 PLpro Inhibitor, 52
Type:
Small Organic Molecule
Emp. Form.:
C22H26N4O
Mol. Mass.:
362.468
SMILES:
CC(NC(=O)c1cc(ccc1C)N(C)C1CNC1)c1cccc2cc[nH]c12
: