Target
Proto-oncogene tyrosine-protein kinase receptor Ret
Ligand
BDBM370389
Substrate
Meas. Tech.
Inhibitory Activity Assay
IC50
1.07±n/a nM
Citation
 Miyazaki, IShimamura, TKato, MFujita, H Fused pyrimidine compound or salt thereof US Patent  US11014930 Publication Date 5/25/2021 
Target
Name:
Proto-oncogene tyrosine-protein kinase receptor Ret
Synonyms:
CDHF12 Cadherin family member 12 Proto-oncogene c-Ret RET51 Tyrosine-protein kinase Ret (RET)
Type:
Protein
Mol. Mass.:
124318.29
Organism:
Homo sapiens (Human)
Description:
P07949
Residue:
1114
  
Inhibitor
Name:
BDBM370389
Synonyms:
US10233189, Example 22 US11014930, Example 22 | US11236096, Example 22
Type:
Small organic molecule
Emp. Form.:
C12H13BrN8O
Mol. Mass.:
365.189
SMILES:
CC(C)n1nc(C(=O)Nc2cc(Br)[nH]n2)c2c(N)ncnc12
: