Target
Proto-oncogene tyrosine-protein kinase receptor Ret
Ligand
BDBM464419
Substrate
Meas. Tech.
Inhibitory Activity Assay
IC50
0.160±n/a nM
Citation
 Miyazaki, IShimamura, TKato, MFujita, H Fused pyrimidine compound or salt thereof US Patent  US11014930 Publication Date 5/25/2021 
Target
Name:
Proto-oncogene tyrosine-protein kinase receptor Ret
Synonyms:
CDHF12 Cadherin family member 12 Proto-oncogene c-Ret RET51 Tyrosine-protein kinase Ret (RET)
Type:
Protein
Mol. Mass.:
124318.29
Organism:
Homo sapiens (Human)
Description:
P07949
Residue:
1114
  
Inhibitor
Name:
BDBM464419
Synonyms:
US10787457, Example 52 US11236096, Example 52
Type:
Small organic molecule
Emp. Form.:
C17H21N7O
Mol. Mass.:
339.3949
SMILES:
Cc1cc(NC(=O)c2cn(c3ncnc(N)c23)C(C)(C)C2CC2)n[nH]1
: