Target
Proto-oncogene tyrosine-protein kinase receptor Ret
Ligand
BDBM464420
Substrate
Meas. Tech.
Inhibitory Activity Assay
IC50
0.760±n/a nM
Citation
 Miyazaki, IShimamura, TKato, MFujita, H Fused pyrimidine compound or salt thereof US Patent  US11014930 Publication Date 5/25/2021 
Target
Name:
Proto-oncogene tyrosine-protein kinase receptor Ret
Synonyms:
CDHF12 Cadherin family member 12 Proto-oncogene c-Ret RET51 Tyrosine-protein kinase Ret (RET)
Type:
Protein
Mol. Mass.:
124318.29
Organism:
Homo sapiens (Human)
Description:
P07949
Residue:
1114
  
Inhibitor
Name:
BDBM464420
Synonyms:
US10787457, Example 53 US11236096, Example 53
Type:
Small organic molecule
Emp. Form.:
C16H21N7O2
Mol. Mass.:
343.3836
SMILES:
COCC(C)(C)n1cc(C(=O)Nc2cc(C)[nH]n2)c2c(N)ncnc12
: