Target
Cathepsin B-like cysteine protease
Ligand
BDBM22081
Substrate
BDBM22047
Meas. Tech.
Enzyme Inhibition Assay
Temperature
298.15±n/a K
IC50
11000±n/a nM
Comments
extracted
Citation
 Mallari, JPShelat, AAObrien, TCaffrey, CRKosinski, AConnelly, MHarbut, MGreenbaum, DMcKerrow, JHGuy, RK Development of potent purine-derived nitrile inhibitors of the trypanosomal protease TbcatB. J Med Chem 51:545-52 (2008)  
Target
Name:
Cathepsin B-like cysteine protease
Synonyms:
CPC Cysteine peptidase C | TbcatB
Type:
Enzyme
Mol. Mass.:
37220.37
Organism:
Trypanosoma brucei
Description:
Enzyme was expressed in yeast Pichia pastoris.
Residue:
340
  
Inhibitor
Name:
BDBM22081
Synonyms:
6-(benzylamino)-9-[(4-methoxyphenyl)methyl]-9H-purine-2-carbonitrile | Compound 3{8,16}
Type:
Small organic molecule
Emp. Form.:
C21H18N6O
Mol. Mass.:
370.4072
SMILES:
COc1ccc(Cn2cnc3c(NCc4ccccc4)nc(nc23)C#N)cc1
:
Substrate
Name:
BDBM22047
Synonyms:
CBZ-Phe-Arg 7-amido-4-methylcoumarin | Z-Phe-Arg-AMC
Type:
Fluorogenic substrate
Emp. Form.:
C33H36N6O6
Mol. Mass.:
612.6755
SMILES:
[#6]-c1cc(=O)oc2cc(-[#7]-[#6](=O)-[#6](-[#6]-[#6]-[#6]\[#7]=[#6](\[#7])-[#7])-[#7]-[#6](=O)-[#6](-[#6]-c3ccccc3)-[#7]-[#6](=O)-[#8]-[#6]-c3ccccc3)ccc12
: