Target
Genome polyprotein [2420-2989,P2914A,R2963Q]
Ligand
BDBM35553
Substrate
poly(A)/oligo(U)18
Meas. Tech.
HCV RNA-Dependent RNA Polymerase Assay (IC50)
pH
7.5±n/a
Temperature
296.15±n/a K
IC50
20±n/a nM
Citation
 Ontoria, JMRydberg, EHDi Marco, STomei, LAttenni, BMalancona, SMartin Hernando, JIGennari, NKoch, UNarjes, FRowley, MSumma, VCarroll, SSOlsen, DBDe Francesco, RAltamura, SMigliaccio, GCarfì, A Identification and Biological Evaluation of a Series of 1H-Benzo[de]isoquinoline-1,3(2H)-diones as Hepatitis C Virus NS5B Polymerase Inhibitors. J Med Chem 52:5217-27 (2009)  
Target
Name:
Genome polyprotein [2420-2989,P2914A,R2963Q]
Synonyms:
HCV NS5B Polymerase Mutant (P495A) | POLG_HCVBK
Type:
Mutant Enzyme
Mol. Mass.:
64256.72
Organism:
Hepatitis C virus genotype 1b (isolate BK) (HCV)
Description:
P26663[2420-2989,P2914A,R2963Q]
Residue:
578
  
Inhibitor
Name:
BDBM35553
Synonyms:
1H-benzo[de]isoquinoline-1,3(2H)-dione, 1
Type:
Small organic molecule
Emp. Form.:
C20H15BrN2O3
Mol. Mass.:
411.249
SMILES:
OCCNc1ccc2C(=O)N(C(=O)c3cccc1c23)c1cccc(Br)c1
:
Substrate
Name:
poly(A)/oligo(U)18
Synonyms:
Type:
homopolymeric template/primer
Mol. Mass.:
358.43
Organism:
Description:
UTP/3H-UTP as co-substrate.
Residue:
3
NA