Target
Methionine aminopeptidase 2
Ligand
BDBM68283
Substrate
Meas. Tech.
Enzymatic Assay
IC50
>5.0e+4±n/a nM
Citation
 Hu, XDang, YTenney, KCrews, PTsai, CWSixt, KMCole, PALiu, JO Regulation of c-Src nonreceptor tyrosine kinase activity by bengamide A through inhibition of methionine aminopeptidases. Chem Biol 14:764-74 (2007)  
Target
Name:
Methionine aminopeptidase 2
Synonyms:
Initiation factor 2-associated 67 kDa glycoprotein MAP2_HUMAN MNPEP Methionine aminopeptidase 2 (MetAP2) P67EIF2 p67
Type:
Enzyme
Mol. Mass.:
52884.45
Organism:
Homo sapiens (Human)
Description:
P50579
Residue:
478
  
Inhibitor
Name:
BDBM68283
Synonyms:
Bengamide G
Type:
Small organic molecule
Emp. Form.:
C30H54N2O8
Mol. Mass.:
570.7584
SMILES:
CCCCCCCCCCCCOC(=O)C1CCC(NC(=O)[C@H](OC)[C@H](O)[C@@H](O)[C@H](O)\C=C\C(C)C)C(=O)NC1
: