Target
Renin
Ligand
BDBM50008520
Substrate
Meas. Tech.
ChEMBL_192891 (CHEMBL795930)
IC50
110±n/a nM
Citation
 Kleemann, HWHeitsch, HHenning, RKramer, WKocher, WLerch, ULinz, WNickel, WURuppert, DUrbach, H Renin inhibitory pentols showing improved enteral bioavailability. J Med Chem 35:559-67 (1992)  
Target
Name:
Renin
Synonyms:
Angiotensinogenase RENI_HUMAN
Type:
Enzyme
Mol. Mass.:
45058.99
Organism:
Homo sapiens (Human)
Description:
Residue:
406
  
Inhibitor
Name:
BDBM50008520
Synonyms:
2-Benzyl-N-[1-(1-cyclohexylmethyl-2,3,4,5,6-pentahydroxy-hexylcarbamoyl)-2-(1H-imidazol-4-yl)-ethyl]-3-(2-methyl-propane-2-sulfonyl)-propionamide | CHEMBL357253
Type:
Small organic molecule
Emp. Form.:
C33H52N4O9S
Mol. Mass.:
680.852
SMILES:
CC(C)(C)S(=O)(=O)CC(Cc1ccccc1)C(=O)NC(Cc1cnc[nH]1)C(=O)N[C@@H](CC1CCCCC1)[C@@H](O)[C@@H](O)[C@H](O)[C@H](O)CO
: