Target
Renin
Ligand
BDBM50008522
Substrate
Meas. Tech.
ChEMBL_195766 (CHEMBL803431)
IC50
22±n/a nM
Citation
 Kleemann, HWHeitsch, HHenning, RKramer, WKocher, WLerch, ULinz, WNickel, WURuppert, DUrbach, H Renin inhibitory pentols showing improved enteral bioavailability. J Med Chem 35:559-67 (1992)  
Target
Name:
Renin
Synonyms:
Angiotensinogenase RENI_HUMAN
Type:
Enzyme
Mol. Mass.:
45058.99
Organism:
Homo sapiens (Human)
Description:
Residue:
406
  
Inhibitor
Name:
BDBM50008522
Synonyms:
4-Amino-cyclohexanecarboxylic acid {1-[1-(1-cyclohexylmethyl-2,3,4,5,6-pentahydroxy-hexylcarbamoyl)-2-(1H-imidazol-4-yl)-ethylcarbamoyl]-2-phenyl-ethyl}-amide | CHEMBL427931
Type:
Small organic molecule
Emp. Form.:
C35H54N6O8
Mol. Mass.:
686.8387
SMILES:
N[C@H]1CC[C@H](CC1)C(=O)N[C@@H](Cc1ccccc1)C(=O)NC(Cc1cnc[nH]1)C(=O)N[C@@H](CC1CCCCC1)[C@@H](O)[C@@H](O)[C@H](O)[C@H](O)CO
: