Target
Cathepsin K
Ligand
BDBM50098584
Substrate
Meas. Tech.
ChEMBL_216705 (CHEMBL820317)
Ki
2±n/a nM
Target
Name:
Cathepsin K
Synonyms:
CATK_HUMAN CTSO Cathepsin O Cathepsin X
Type:
Enzyme
Mol. Mass.:
36975.68
Organism:
Homo sapiens (Human)
Description:
P43235
Residue:
329
  
Inhibitor
Name:
BDBM50098584
Synonyms:
CHEMBL31947 | {1-[4-(2-Benzyloxycarbonylamino-4-methyl-pentanoylamino)-3-oxo-azepane-1-carbonyl]-3-methyl-butyl}-carbamic acid benzyl ester
Type:
Small organic molecule
Emp. Form.:
C34H46N4O7
Mol. Mass.:
622.7516
SMILES:
CC(C)C[C@H](NC(=O)OCc1ccccc1)C(=O)NC1CCCN(CC1=O)C(=O)[C@H](CC(C)C)NC(=O)OCc1ccccc1
: