Target
Genome polyprotein/Non-structural protein 4A
Ligand
BDBM50110126
Substrate
Meas. Tech.
ChEMBL_143774 (CHEMBL750247)
Ki
7±n/a nM
Citation
 Narjes, FKoehler, KFKoch, UGerlach, BColarusso, SSteinkühler, CBrunetti, MAltamura, SDe Francesco, RMatassa, VG A designed P1 cysteine mimetic for covalent and non-covalent inhibitors of HCV NS3 protease. Bioorg Med Chem Lett 12:701-4 (2002)  
Target
Name:
Genome polyprotein/Non-structural protein 4A
Synonyms:
Hepatitis C virus serine protease, NS3/NS4A
Type:
Mol. Mass.:
Description:
ASSAY_ID of ChEMBL is 1969955
Components:
This complex has 2 components.
Component 1
Name:
Non-structural protein 4A
Synonyms:
Hepatitis C virus NS4A protein Non-structural protein 4A
Type:
PROTEIN
Mol. Mass.:
5762.65
Organism:
Hepatitis C virus
Description:
ChEMBL_305334
Residue:
54
  
Component 2
Name:
Genome polyprotein
Synonyms:
Hepatitis C virus NS3 protease/helicase | Hepatitis C virus serine protease, NS3/NS4A
Type:
Protein
Mol. Mass.:
67067.41
Organism:
Hepatitis C virus
Description:
A3EZI9
Residue:
631
  
Inhibitor
Name:
BDBM50110126
Synonyms:
4-(2-Acetylamino-3-carboxy-propionylamino)-4-(1-{3-carboxy-1-[2-cyclohexyl-1-(1-formyl-but-3-enylcarbamoyl)-ethylcarbamoyl]-propylcarbamoyl}-2,2-diphenyl-ethylcarbamoyl)-butyric acid | CHEMBL162028
Type:
Small organic molecule
Emp. Form.:
C45H58N6O13
Mol. Mass.:
890.9744
SMILES:
CC(=O)N[C@@H](CC(O)=O)C(=O)N[C@@H](CCC(O)=O)C(=O)N[C@@H](C(c1ccccc1)c1ccccc1)C(=O)N[C@@H](CCC(O)=O)C(=O)N[C@@H](CC1CCCCC1)C(=O)N[C@@H](CC=C)C=O
: