Target
ATP-dependent translocase ABCB1
Ligand
BDBM50103596
Substrate
Meas. Tech.
ChEMBL_2031231 (CHEMBL4685389)
EC50
916±n/a nM
Citation
 Antoni, FBause, MScholler, MBauer, SStark, SAJackson, SMManolaridis, ILocher, KPKönig, BBuschauer, ABernhardt, G Tariquidar-related triazoles as potent, selective and stable inhibitors of ABCG2 (BCRP). Eur J Med Chem 191:0 (2020)  
Target
Name:
ATP-dependent translocase ABCB1
Synonyms:
ABCB1 MDR1_HUMAN Multidrug resistance protein 1 P-glycoprotein (P-gp) PGY1
Type:
Protein
Mol. Mass.:
141503.50
Organism:
Homo sapiens (Human)
Description:
P08183
Residue:
1280
  
Inhibitor
Name:
BDBM50103596
Synonyms:
(E)-2-hydroxy-5-((4-(N-pyridin-2-ylsulfamoyl)-phenyl)diazenyl) benzoic acid (A8) Azulfidine EN CHEBI:9334 S.A.S.-500 Salazopyrin Salicylazosulfapyridine Sulphasalazine | US11744839, Compound of formula 1
Type:
Small organic molecule
Emp. Form.:
C18H14N4O5S
Mol. Mass.:
398.393
SMILES:
OC(=O)c1cc(ccc1O)\N=N\c1ccc(cc1)S(=O)(=O)Nc1ccccn1
: