Target
Thyroid hormone receptor alpha
Ligand
BDBM18884
Substrate
Meas. Tech.
ChEMBL_210491 (CHEMBL814598)
Kd
200±n/a nM
Citation
 Nguyen, NHApriletti, JWCunha Lima, STWebb, PBaxter, JDScanlan, TS Rational design and synthesis of a novel thyroid hormone antagonist that blocks coactivator recruitment. J Med Chem 45:3310-20 (2002)  
Target
Name:
Thyroid hormone receptor alpha
Synonyms:
C-erbA-alpha EAR7 NR1A1 THA_HUMAN THRA1 Thyroid Hormone Receptor (TR-alpha) Thyroid hormone receptor alpha c-erbA-1
Type:
Receptor
Mol. Mass.:
54818.00
Organism:
Homo sapiens (Human)
Description:
Recombinant hThR was obtained from nuclear extracts from SF9 cells infected with baculovirus vectors encoding for ThRalpha 1.
Residue:
490
  
Inhibitor
Name:
BDBM18884
Synonyms:
2-(4-{[4-hydroxy-3-(4-nitrophenyl)-5-(propan-2-yl)phenyl]methyl}-3,5-dimethylphenoxy)acetic acid JMC496635 Compound 4 | thyromimetic, 5a
Type:
Small organic molecule
Emp. Form.:
C26H27NO6
Mol. Mass.:
449.4957
SMILES:
CC(C)c1cc(Cc2c(C)cc(OCC(O)=O)cc2C)cc(c1O)-c1ccc(cc1)[N+]([O-])=O
: