Target
C-C chemokine receptor type 3
Ligand
BDBM50209983
Substrate
Meas. Tech.
ChEMBL_458974 (CHEMBL925069)
IC50
1.6±n/a nM
Citation
 Pruitt, JRBatt, DGWacker, DABostrom, LLBooker, SKMcLaughlin, EHoughton, GCVarnes, JGChrist, DDCovington, MDas, AMDavies, PGraden, DKariv, IOrlovsky, YStowell, NCVaddi, KGWadman, EAWelch, PKYeleswaram, SSolomon, KANewton, RCDecicco, CPCarter, PHKo, SS CC chemokine receptor-3 (CCR3) antagonists: improving the selectivity of DPC168 by reducing central ring lipophilicity. Bioorg Med Chem Lett 17:2992-7 (2007)  
Target
Name:
C-C chemokine receptor type 3
Synonyms:
C-C CKR-3 CC-CKR-3 CCR3 CD_antigen=CD193 CMKBR3 | Eosinophil eotaxin receptor
Type:
Enzyme
Mol. Mass.:
41053.88
Organism:
Homo sapiens (Human)
Description:
P51677
Residue:
355
  
Inhibitor
Name:
BDBM50209983
Synonyms:
1-((3R,4R)-3-(((S)-3-(4-fluorobenzyl)piperidin-1-yl)methyl)-1-(2-(dimethylamino)acetyl)piperidin-4-yl)-3-(5-acetyl-4-methylthiazol-2-yl)urea | CHEMBL401159
Type:
Small organic molecule
Emp. Form.:
C29H41FN6O3S
Mol. Mass.:
572.738
SMILES:
CN(C)CC(=O)N1CC[C@@H](NC(=O)Nc2nc(C)c(s2)C(C)=O)[C@H](CN2CCC[C@@H](Cc3ccc(F)cc3)C2)C1
: