Target
Cysteine protease
Ligand
BDBM50268445
Substrate
Meas. Tech.
ChEMBL_591545 (CHEMBL1062951)
IC50
1400±n/a nM
Citation
 Mallari, JPShelat, AAKosinski, ACaffrey, CRConnelly, MZhu, FMcKerrow, JHGuy, RK Structure-guided development of selective TbcatB inhibitors. J Med Chem 52:6489-93 (2009)  
Target
Name:
Cysteine protease
Synonyms:
Rhodesain
Type:
PROTEIN
Mol. Mass.:
48425.78
Organism:
Trypanosoma brucei rhodesiense
Description:
ChEMBL_619861
Residue:
450
  
Inhibitor
Name:
BDBM50268445
Synonyms:
6-((4'-chlorobiphenyl-3-yl)methylamino)-9-(3-hydroxypropyl)-9H-purine-2-carbonitrile | CHEMBL523733
Type:
Small organic molecule
Emp. Form.:
C22H19ClN6O
Mol. Mass.:
418.879
SMILES:
OCCCn1cnc2c(NCc3cccc(c3)-c3ccc(Cl)cc3)nc(nc12)C#N
: