Target
Dipeptidyl peptidase 4
Ligand
BDBM50349377
Substrate
Meas. Tech.
ChEMBL_760118 (CHEMBL1810495)
IC50
84±n/a nM
Citation
 Maezaki, HBanno, YMiyamoto, YMoritoh, YMoritou, YAsakawa, TKataoka, OTakeuchi, KSuzuki, NIkedo, KKosaka, TSasaki, MTsubotani, STani, AFunami, MYamamoto, YTawada, MAertgeerts, KYano, JOi, S Discovery of potent, selective, and orally bioavailable quinoline-based dipeptidyl peptidase IV inhibitors targeting Lys554. Bioorg Med Chem 19:4482-98 (2011)  
Target
Name:
Dipeptidyl peptidase 4
Synonyms:
ADABP Adenosine deaminase complexing protein 2 CD_antigen=CD26 DPP4 DPPIV Dipeptidyl peptidase 4 (DPP IV) Dipeptidyl peptidase 4 (DPP4) Dipeptidyl peptidase 4 membrane form Dipeptidyl peptidase IV Dipeptidyl peptidase IV (DDP-IV) Dipeptidyl peptidase IV membrane form Dipeptidyl peptidase-IV (DPP-4) T-cell activation antigen CD26 | TP103
Type:
Enzyme
Mol. Mass.:
88271.01
Organism:
Homo sapiens (Human)
Description:
P27487
Residue:
766
  
Inhibitor
Name:
BDBM50349377
Synonyms:
CHEMBL1808465
Type:
Small organic molecule
Emp. Form.:
C24H28N2O3
Mol. Mass.:
392.4907
SMILES:
COC(=O)COc1ccc2nc(CC(C)C)c(CN)c(-c3ccc(C)cc3)c2c1
: