Target
Dipeptidyl peptidase 4
Ligand
BDBM50349387
Substrate
Meas. Tech.
ChEMBL_760118 (CHEMBL1810495)
IC50
49±n/a nM
Citation
 Maezaki, HBanno, YMiyamoto, YMoritoh, YMoritou, YAsakawa, TKataoka, OTakeuchi, KSuzuki, NIkedo, KKosaka, TSasaki, MTsubotani, STani, AFunami, MYamamoto, YTawada, MAertgeerts, KYano, JOi, S Discovery of potent, selective, and orally bioavailable quinoline-based dipeptidyl peptidase IV inhibitors targeting Lys554. Bioorg Med Chem 19:4482-98 (2011)  
Target
Name:
Dipeptidyl peptidase 4
Synonyms:
ADABP Adenosine deaminase complexing protein 2 CD_antigen=CD26 DPP4 DPPIV Dipeptidyl peptidase 4 (DPP IV) Dipeptidyl peptidase 4 (DPP4) Dipeptidyl peptidase 4 membrane form Dipeptidyl peptidase IV Dipeptidyl peptidase IV (DDP-IV) Dipeptidyl peptidase IV membrane form Dipeptidyl peptidase-IV (DPP-4) T-cell activation antigen CD26 | TP103
Type:
Enzyme
Mol. Mass.:
88271.01
Organism:
Homo sapiens (Human)
Description:
P27487
Residue:
766
  
Inhibitor
Name:
BDBM50349387
Synonyms:
CHEMBL1809263
Type:
Small organic molecule
Emp. Form.:
C22H24FN3O2
Mol. Mass.:
381.4433
SMILES:
CC(C)Cc1nc2ccc(OCC(N)=O)cc2c(-c2cccc(F)c2)c1CN
: